Error found dangling ssl error



Converter Configure Machine fails with error Found dangling SSL error

I’m trying to perform the following VM conversion:

Converter version: VMware vCenter Converter Standalone client, 4.3.0 build 292238
Physical machine to be convertered: Windows XP SP3
Task: Reconfigure and Customize virtual machine
Status: FAILED: A general system error occurred: Assert failed at d:/build/ob/bora-
292238/bora/sysimage/lib/c onverter/a gent/agent Tasks/fsUp dates.cpp: 156, function bool
__cdecl Converter::Agent::AdjustEx tendedVolu mes(class Vmacore::Service::Logger *,
class Converter::Computer *,class Converter::Computer *,class Converter::Agent::Params::
StorageMapping *), condition sourceVolumeInfo
Result: FAILED at 98%
Log highlights: Error: An error occurred during reconfiguration.

Section for VMware vCenter Converter Standalone, pid=2416, version=4.3.0, build=build-292238, option=Release
[2011-05-02 08:24:12.462 02420 warning ‘App’] Failed to create console writer
[2011-05-02 08:24:12.478 02444 info ‘App’] Current working directory: C:\Program Files (x86)\VMware\VMware vCenter Converter Standalone
[2011-05-02 08:24:12.478 02444 info ‘App’] Trying converter_server
[2011-05-02 08:24:12.899 02444 info ‘App’] [shutdownMgr,25] Ufa shutdown manager registered.
[2011-05-02 08:24:12.899 02444 info ‘App’] [helper,453] Initializing SSL Contexts
[2011-05-02 08:24:13.008 02444 info ‘Libs’] Using system libcrypto, version 9080CF
[2011-05-02 08:24:14.443 02444 info ‘App’] Vmacore::InitSSL: doVersionCheck = true, handshakeTimeoutUs = 120000000
[2011-05-02 08:24:14.443 02444 info ‘App’] [helper,499] Initializing certificates
[2011-05-02 08:24:14.443 02444 info ‘App’] [task,2061] [LRO] 32 max LROs
[2011-05-02 08:24:14.443 02444 info ‘App’] [task,2063] [LRO] 6 reserved internal LROs
[2011-05-02 08:24:14.443 02444 info ‘App’] [task,2065] [LRO] 6 reserved short LROs
[2011-05-02 08:24:14.443 02444 info ‘App’] [task,2067] [LRO] 12 reserved long LROs
[2011-05-02 08:24:14.443 02444 info ‘App’] [task,2079] [LRO] 86400-second task lifetime
[2011-05-02 08:24:14.506 02444 warning ‘Locale’] Duplicate key ‘hi_IN’ in file ‘C:\Program Files (x86)\VMware\VMware vCenter Converter Standalone\locale\iso2win. vlcl’
[2011-05-02 08:24:14.506 02444 warning ‘Locale’] Duplicate key ‘az_AZ’ in file ‘C:\Program Files (x86)\VMware\VMware vCenter Converter Standalone\locale\iso2win. vlcl’
[2011-05-02 08:24:14.506 02444 warning ‘Locale’] Duplicate key ‘sr_SP’ in file ‘C:\Program Files (x86)\VMware\VMware vCenter Converter Standalone\locale\iso2win. vlcl’
[2011-05-02 08:24:14.506 02444 warning ‘Locale’] Duplicate key ‘az_AZ’ in file ‘C:\Program Files (x86)\VMware\VMware vCenter Converter Standalone\locale\isodata. vlcl’
[2011-05-02 08:24:14.506 02444 warning ‘Locale’] Duplicate key ‘sr_SP’ in file ‘C:\Program Files (x86)\VMware\VMware vCenter Converter Standalone\locale\isodata. vlcl’
[2011-05-02 08:24:14.506 02444 warning ‘Locale’] Duplicate key ‘uz_UZ’ in file ‘C:\Program Files (x86)\VMware\VMware vCenter Converter Standalone\locale\isodata. vlcl’
[2011-05-02 08:24:14.537 02444 info ‘Locale’] Added locale path C:\Program Files (x86)\VMware\VMware vCenter Converter Standalone\locale\ to locale map
[2011-05-02 08:24:14.537 02444 info ‘Locale’] Locale subsystem initialized from C:\Program Files (x86)\VMware\VMware vCenter Converter Standalone\locale\ with default locale en.
[2011-05-02 08:24:14.631 02444 info ‘Libs’] [ADS] Local Domain : MCDNET
[2011-05-02 08:24:14.631 02444 info ‘Libs’] [ADS] IsWorkgroup: No
[2011-05-02 08:24:14.631 02444 info ‘Libs’] [ADS] Local Machine: TMAC-HOV
[2011-05-02 08:24:14.631 02444 info ‘App’] BaseScheduler initialization complete — void __thiscall Converter::Server::Schedul er::BaseSc heduler::I nitialize( const class boost::shared_ptr er::Schedu lerEnv>,co nst class boost::optional er::Schedu lerConstra ints const &> &,const class boost::optional &) («d:/build/ob/bora-292238/ bora/sysim age/ufad/s erver/sche duler/base Scheduler. cpp:112»)
[2011-05-02 08:24:14.709 02444 info ‘App’] [plugin,160] ServerPlugin Init
[2011-05-02 08:24:14.709 02444 info ‘App’] Trying ufa_agent
[2011-05-02 08:24:14.724 02444 info ‘Ufa’] Initializing SSL context
[2011-05-02 08:24:14.724 02444 info ‘Ufa’] Plugin initialized
[2011-05-02 08:24:14.755 02780 info ‘App’] [task,332] [task-internal-1] — BEGIN — TaskManager
[2011-05-02 08:24:14.755 02444 info ‘App’] Loaded all items from the scheduler’s database tables. — void __thiscall Converter::Server::Schedul er::BaseSc heduler::L oadSchedul erItemIdMa p(void) («d:/build/ob/bora-292238/ bora/sysim age/ufad/s erver/sche duler/base Scheduler. cpp:70»)
[2011-05-02 08:24:14.755 02444 info ‘App’] Loaded all items from scheduler’s database tables.Scheduler’s item map contains 2 items. — void __thiscall Converter::Server::Schedul er::Priori tyQSchedul er::LoadPr iorityQ(vo id) («d:/build/ob/bora-292238/ bora/sysim age/ufad/s erver/sche duler/prio rityQSched uler.cpp:1 83»)
[2011-05-02 08:24:14.755 02444 info ‘App’] [plugin,191] ServerPlugin Start
[2011-05-02 08:24:14.755 02444 info ‘Ufa’] SOAP pipe name: \\.\pipe\vmware-converter- server-soa p
[2011-05-02 08:24:14.755 02444 info ‘Ufa.HTTPService’] Using default for nonChunkingAgents: ‘VMware VI Client|VMware-client|VMwar e-client/3 .*’
[2011-05-02 08:24:14.755 02444 info ‘Ufa.HTTPService’] Using default for agentsNeedingContentLength : ‘VMware-client’
[2011-05-02 08:24:14.755 02444 info ‘Ufa.HTTPService’] Max buffered response size is 104857600 bytes
[2011-05-02 08:24:14.755 02444 info ‘Ufa’] doPendedPostBodyReads: false, enableChunkedResponses: true
[2011-05-02 08:24:14.755 02784 info ‘App’] Scheduler scheduling item 3 to run at time = 2011-05-02 08:24:14.755. — void __thiscall Converter::Server::Schedul er::Simple Scheduler: :Run(void) («d:/build/ob/bora-292238/ bora/sysim age/ufad/s erver/sche duler/simp leSchedule r.cpp:88»)
[2011-05-02 08:24:14.771 02788 warning ‘App’] Failed to insert scheduler mapping for job «8»; Reason: Object not found . ignoring — void __thiscall Converter::Server::Job::Jo b2Schedule rItemTable ::LoadData FromDataba se(void) («d:/build/ob/bora-292238/ bora/sysim age/lib/co nverter/se rver/job/j ob2Schedul erItemTabl e.cpp:638» )
[2011-05-02 08:24:14.771 02788 warning ‘App’] Failed to insert scheduler mapping for job «17»; Reason: Object not found . ignoring — void __thiscall Converter::Server::Job::Jo b2Schedule rItemTable ::LoadData FromDataba se(void) («d:/build/ob/bora-292238/ bora/sysim age/lib/co nverter/se rver/job/j ob2Schedul erItemTabl e.cpp:638» )
[2011-05-02 08:24:14.771 02788 warning ‘App’] const class Converter::Server::Job::Jo b2Schedule rItemTable ::Job2Item Row &__thiscall Converter::Server::Job::Jo b2Schedule rItemTable ::GetRow(c onst int &) const — scheduler item with was not found in the job 2 scheduler item table. . skipping item=»3″. — void __thiscall Converter::Server::Job::Jo bProcessor Impl::Star tProcessin gJobs(void ) («d:/build/ob/bora-292238/ bora/sysim age/lib/co nverter/se rver/job/j obProcesso rImpl.cpp: 380»)
[2011-05-02 08:24:14.771 02444 info ‘Ufa.HTTPService’] Http Service started: [class Vmacore::System::NamedPipe ServerWin3 2:033E6550 ]
[2011-05-02 08:24:14.771 02444 info ‘Ufa’] Soap (over Named Pipe) started on pipe \\.\pipe\vmware-converter- server-soa p. enableRemoteAccess = false, nonRootAccess = true, useSSL = false
[2011-05-02 08:24:14.771 02444 info ‘Ufa’] Plugin started
[2011-05-02 08:24:14.771 02444 info ‘App’] [serviceWin32,413] vmware-converter-server service started
[2011-05-02 08:24:14.771 02788 warning ‘App’] No entry in the job2SchedulerItem table for unexecuted item (3): Unable to find row in job2SchedulerItem table for item with — scheduler item with was not found in the job 2 scheduler item table. . deleted item and ignoring. — void __thiscall Converter::Server::Job::Jo bProcessor Impl::Star tProcessin gJobs(void ) («d:/build/ob/bora-292238/ bora/sysim age/lib/co nverter/se rver/job/j obProcesso rImpl.cpp: 406»)
[#1] [2011-05-02 08:25:56.022 02796 info ‘Libs’] HOSTINFO 421079727 @ 2766640Hz -> 0 @ 1000000Hz
[#1] [2011-05-02 08:25:56.022 02796 info ‘Libs’] HOSTINFO ((x * 3104825561) >> 33) + -152198958
[#2] [2011-05-02 08:26:23.103 04192 error ‘App’] Found dangling SSL error: [0] error:00000001:lib(0):func (0):reason (1)
[#2] [2011-05-02 08:27:06.694 02984 info ‘App’] Created new scheduler item with , firstTimeToRun = «2011-05-02 08:27:06.694», source = «EF:63:F2:FB:95:0A:75:BC:0 1:97:3D:64 :98:71:EE: 77:E7:B6:F F:CF», targetRPOInMinutes = «0». — __thiscall Converter::Server::Schedul er::Schedu lerItemImp l::Schedul erItemImpl (const class Converter::Server::Schedul er::Schedu lerItemSpe c &,const int &,const class boost::shared_ptr er::Schedu lerEnv> &,const class Vmacore::Ref &,const class boost::optional &) («d:/build/ob/bora-292238/ bora/sysim age/ufad/s erver/sche duler/sche dulerItemI mpl.cpp:87 «)
[#2] [2011-05-02 08:27:06.694 02984 info ‘App’] scheduler item with created — int __thiscall Converter::Server::Schedul er::Priori tyQSchedul er::AddSch edulerItem (const class boost::shared_ptr er::Schedu lerItemSpe c> &,const class boost::optional &) («d:/build/ob/bora-292238/ bora/sysim age/ufad/s erver/sche duler/prio rityQSched uler.cpp:4 6»)
[2011-05-02 08:27:06.709 02784 info ‘App’] Scheduler scheduling item 4 to run at time = 2011-05-02 08:27:06.709. — void __thiscall Converter::Server::Schedul er::Simple Scheduler: :Run(void) («d:/build/ob/bora-292238/ bora/sysim age/ufad/s erver/sche duler/simp leSchedule r.cpp:88»)
[#2] [2011-05-02 08:27:06.769 02984 info ‘App’] ConverterConnection: KeepAlive timer canceled, StopKeepAlive succeeded
[#2] [2011-05-02 08:27:06.773 02984 info ‘vmomi.soapStub[0]’] Resetting stub adapter for server PIPE:\\.\pipe\vmware-conve rter-worke r-soap : Closed
[2011-05-02 08:27:06.863 02788 info ‘App’] Started task «task-5″ for job=»job-21″, item =»4» — void __thiscall Converter::Server::Job::Jo bProcessor Impl::Star tProcessin gJobs(void ) («d:/build/ob/bora-292238/ bora/sysim age/lib/co nverter/se rver/job/j obProcesso rImpl.cpp: 351»)
[2011-05-02 08:27:06.886 03916 info ‘App’] [task,332] [task-5] — BEGIN — Convert
[2011-05-02 08:27:06.892 03916 error ‘App’] Found dangling SSL error: [0] error:00000001:lib(0):func (0):reason (1)
[2011-05-02 08:27:06.922 03916 info ‘App’] [taskSpec,464] [task-5] [TaskMap] task-5:task-1
[2011-05-03 08:16:18.203 03916 error ‘App’] [task,344] [LRO] Unexpected Exception: vmodl.fault.SystemError
[2011-05-03 08:16:18.313 03916 info ‘App’] [task,373] [task-5] — ERROR — Convert: vmodl.fault.SystemError
(vmodl.fault.SystemError) <
dynamicType = ,
faultCause = (vmodl.MethodFault) null,
reason = «Assert failed at d:/build/ob/bora-292238/bo ra/sysimag e/lib/conv erter/agen t/agentTas ks/fsUpdat es.cpp:156 , function bool __cdecl Converter::Agent::AdjustEx tendedVolu mes(class Vmacore::Service::Logger *,class Converter::Computer *,class Converter::Computer *,class Converter::Agent::Params:: StorageMap ping *), condition sourceVolumeInfo»,
msg = «»,
>
[2011-05-03 08:16:18.313 03916 info ‘App’] [diagnosticManager,260] Retrieved taskInfo for «converter.task.Task:task- 5» mapping it to «converter.task.Task:task- 5».
[2011-05-03 08:16:18.313 03916 info ‘App’] [diagnosticManager,300] The task with was found to be a «recent» task.
[2011-05-03 08:16:18.313 03916 info ‘App’] [diagnosticManager,314] No existing log bundle found for task with . The task is still «recent» so a log bundle will now be generated for it.
[2011-05-03 08:16:18.313 03916 info ‘App’] [diagnosticManager,756] Retrieving task related diagnostics for server task with .
[2011-05-03 08:16:18.469 02792 info ‘App’] Suspended 1 scheduler items for job (job-21) — void __thiscall Converter::Server::Job::Jo bProcessor Impl::Susp endJobAux( const class Converter::Server::Job::In ternalJob &,class Converter::VdbConnection &) («d:/build/ob/bora-292238/ bora/sysim age/lib/co nverter/se rver/job/j obProcesso rImpl.cpp: 823»)

Читайте также:  No statement parsed error

I am running VMware vCenter Converter Standalone client on a Windows 7 Prof computer writing the VM file on a local dirve in the pc. The XP computer being copied is remote. I have attempted this conversion several times with different configurations with identical results.

Источник

Error found dangling ssl error

I’m getting below error when starting vcenter service after a database migration. DB migration was done within the same host moving the vcenter db from SQL express 2005 to SQL express 2008.

Below was taken from running the vcenter service on the foreground «vpxd -s»

Appreciate any advice to resolve this issue.

2013-07-31T16:16:33.273+05:30 [02192 info ‘[SSO][SsoFactory_CreateFacade]’] Solution user set to: vCenterServer_2013.07.30_141259

2013-07-31T16:16:33.273+05:30 [02192 info ‘[SSO][SsoFactory_CreateFacade]’] VC’s ServiceId in LookupService: <3A38DE76-EA0E-44FD-BCB4-7B054122B10E>:5

2013-07-31T16:16:33.273+05:30 [02192 info ‘[SSO][SsoFactory_CreateFacade]’] STS URI set to: https://192.168.1.111:7444/ims/STSService?wsdl

2013-07-31T16:16:33.273+05:30 [02192 info ‘[SSO][SsoFactory_CreateFacade]’] Admin URI set to: https://192.168.1.111:7444/sso-adminserver/sdk

2013-07-31T16:16:33.273+05:30 [02192 info ‘[SSO][SsoFactory_CreateFacade]’] Groupcheck URI set to: https://192.168.1.111:7444/sso-adminserver/sdk

2013-07-31T16:16:33.273+05:30 [02192 info ‘[SSO][SsoFactory_CreateFacade]’] VC SSL certificate location: C:\ProgramData\VMware\VMware VirtualCenter\ssl\rui.crt

2013-07-31T16:16:33.276+05:30 [02192 info ‘[SSO][CreateSsoFacade]’] [CreateUserDirectory] STS URI set to: https://192.168.1.111:7444/ims/STSService?wsdl

2013-07-31T16:16:33.276+05:30 [02192 info ‘[SSO][CreateSsoFacade]’] [CreateUserDirectory] Admin URI set to: https://192.168.1.111:7444/sso-adminserver/sdk

2013-07-31T16:16:33.276+05:30 [02192 info ‘[SSO][CreateSsoFacade]’] [CreateUserDirectory] Groupcheck URI set to: https://192.168.1.111:7444/sso-adminserver/sdk

2013-07-31T16:16:33.465+05:30 [02192 error ‘Default’] Found dangling SSL error: [0] error:00000001:lib(0):func(0):reason(1)

2013-07-31T16:16:33.465+05:30 [02192 error ‘Default’] Found dangling SSL error: [1] error:00000001:lib(0):func(0):reason(1)

2013-07-31T16:16:33.467+05:30 [02192 error ‘[SSO][SsoFactory_CreateFacade]’] Unable to create SSO facade: vmodl.fault.SystemError.

2013-07-31T16:16:33.467+05:30 [02192 error ‘vpxdvpxdMain’] [Vpxd::ServerApp::Init] Init failed: Vpx::Common::Sso::SsoFactory_CreateFacade(sslContext, ssoFacadeConstPtr)

—> backtrace[00] rip 000000018018aa3a

—> backtrace[01] rip 0000000180102b18

—> backtrace[02] rip 0000000180103f3e

—> backtrace[03] rip 000000018008d6db

—> backtrace[04] rip 0000000000b15c2c

—> backtrace[05] rip 0000000000b36512

—> backtrace[06] rip 000000013fe22821

Читайте также:  Error 1307 что это

—> backtrace[07] rip 000000013fe1c63c

—> backtrace[08] rip 000000014003ce9d

—> backtrace[09] rip 000000014003d2ef

—> backtrace[10] rip 000000014072db02

—> backtrace[11] rip 000000007707466d

—> backtrace[12] rip 00000000771a81d1

2013-07-31T16:16:33.468+05:30 [02192 warning ‘VpxProfiler’] ServerApp::Init [TotalTime] took 16215 ms

2013-07-31T16:16:33.469+05:30 [02192 error ‘Default’] Failed to intialize VMware VirtualCenter. Shutting down.

2013-07-31T16:16:33.471+05:30 [02192 info ‘vpxdvpxdSupportManager’] Wrote uptime information

2013-07-31T16:16:41.256+05:30 [02896 warning ‘VpxProfiler’ opID=SWI-811bd35e] VpxUtil_InvokeWithOpId [TotalTime] took 12000 ms

2013-07-31T16:16:53.255+05:30 [02896 warning ‘VpxProfiler’ opID=SWI-53d717f9] VpxUtil_InvokeWithOpId [TotalTime] took 12000 ms

2013-07-31T16:17:05.255+05:30 [01012 warning ‘VpxProfiler’ opID=SWI-94c437ac] VpxUtil_InvokeWithOpId [TotalTime] took 12000 ms

2013-07-31T16:17:17.254+05:30 [00352 warning ‘VpxProfiler’ opID=SWI-f07e261d] VpxUtil_InvokeWithOpId [TotalTime] took 12000 ms

2013-07-31T16:17:20.985+05:30 [02192 info ‘Default’] Forcing shutdown of VMware VirtualCenter now

Источник

Оцените статью
toolgir.ru
Adblock
detector